{"text_format":"1","workbook":"xlsx","n_sheets":8,"sheets":["Instruções","Contrato de Trabalho","ESTAGIAR","Bolsa","CT - Tabela","Bolsas - Tabela","Estagiar - Tabela","Listas"],"not_rendered":{"charts":0,"images":3,"macros":1,"external_links":0,"defined_names":43,"comments":0,"pivot_tables":0},"unopened":[],"bounds":{"document_bytes":16777216,"sheet_cells":100000,"rows_first":2000,"rows_last":500,"rows_between":2000,"halvings":0,"cell_chars":16384,"cell_head_chars":4096},"cells_cut":0,"cells_raw":0,"read":"whole","date_system":"1900"}

{"sheet":"Instruções","index":0,"n_rows":33,"n_cols":9,"rows_kept":33,"cut":false,"hidden":false,"merged":[[2,2,2,8],[3,2,3,8]]}
[]
[]
[null,null,"SIMULADOR DE CUSTOS COM RECURSOS HUMANOS"]
[null,null,"Instruções"]
[]
[null,null,null,null,null,null,null,"Versão","2023-11-08"]
[]
[null,"Para que o simulador funcione corretamente, é necessário seguir os seguintes passos:"]
[]
[null,"1. Depois de descarregar o ficheiro, desbloquer o mesmo."]
[]
[]
[]
[]
[]
[]
[]
[]
[]
[]
[]
[]
[]
[]
[]
[]
[]
[]
[]
[]
[]
[]
[null,"2. Abrir o ficheiro e clicar em \"Ativar Edição\"."]

{"sheet":"Contrato de Trabalho","index":1,"n_rows":106,"n_cols":16,"rows_kept":106,"cut":false,"hidden":false,"merged":[[43,13,44,13],[43,14,44,14],[43,15,44,15],[2,2,2,15],[3,2,3,15],[41,1,41,6],[26,1,26,6],[13,1,13,6],[21,1,21,6],[22,1,22,6],[11,1,11,6],[12,1,12,6],[19,1,19,6],[20,1,20,6],[40,1,40,6],[36,1,36,6]]}
[]
[]
[null,null,"SIMULADOR DE CUSTOS COM RECURSOS HUMANOS"]
[null,null,"Contrato de Trabalho"]
[]
[null,null,null,null,null,null,null,null,null,null,null,null,null,null,"Versão","2024-01-26"]
[]
[null,"Pressupostos de Contratação"]
[]
[null,"Tipo de Termo","Certo"]
[]
[null,"Nos termos do Art.º 60º da Lei Geral do Trabalho em Funções Públicas (LTFP):"]
[null,"1. O contrato a termo certo dura até 3 anos (36 meses), incluido renovações. Este contrato não pode ser renovado mais do que 2 vezes."]
[null,"2. O contrato a termo incerto dura por todo o tempo necessário para a substituição do trabalhador ausente ou para a conclusão da tarefa ou serviço cuja execução justifica a celebração. "]
[]
[null,"Duração (meses)",24]
[]
[null,"Categoria Profissional","Tecnico Superior"]
[]
[null,"Nos termos do Art.º 88º da LTFP, as carreiras gerais são as de Técnico Superior, de Assistente Técnico, e de Assistente Operacional."]
[null,"Nos termos do Art.º 86º e do ponto 2 do Art.º 88º, ambos da LTFP:"]
[null,"1. Os Técnicos Superiores são titulares de licenciatura ou de grau académico superior a esta; e auferem, no minimo, ao equivalente à posição 16 da Tabela Remuneratória Única."]
[null,"2. Os Assistentes Técnicos são titulares do 12.º ano de escolaridade ou de curso equiparado; e auferem, no minimo, ao equivalente à posição 6 da Tabela Remuneratória Única."]
[]
[null,"Tem ou Terá Grau de Doutor?","Nao"]
[]
[null,"Nos termos do Art.º 39º - B da LTFP, os Técnicos Superiores que tenham ou venham a ter o grau de doutor auferem o equivalente ao nivel 23 da Tabela Remuneratória Única; ou, caso já aufiram o equivalente ao referido nível, passam a estar enquadrados na posição imediatamente seguinte àquela em que se encontra."]
[]
[null,"Posição Remuneratória","16 - 1385,99",null,null,null,{"$f":"INT(LEFT(C29,(FIND(\" \",C29,1)-1)))","v":16}]
[]
[null,"Data de Início (Mês/Ano)","2024-01-01"]
[]
[null,"Taxa de IRS",7.0000000000000007E-2]
[]
[null,"Segurança Social - Funcionário",0.11]
[]
[null,"A Taxa de IRS deverá ser preenchida conforme a aplicável para o trabalhador. Neste contexto poderão ser consultadas as tabelas em vigor aqui: https://info.portaldasfinancas.gov.pt/pt/apoio_contribuinte/tabela_ret_doclib/Pages/default.aspx"]
[]
[null,"Estimativas"]
[]
{"$rows_left_out":67}
{"sheet":"ESTAGIAR","index":2,"n_rows":65,"n_cols":6,"rows_kept":65,"cut":false,"hidden":false,"merged":[[30,1,30,4],[11,1,11,4],[2,2,2,5],[3,2,3,5],[9,1,9,4],[15,1,15,4],[16,1,16,4],[17,1,17,4],[18,1,18,4],[24,1,24,4],[10,1,10,4]]}
[]
[]
[null,null,"SIMULADOR DE CUSTOS COM RECURSOS HUMANOS"]
[null,null,"Programa ESTAGIAR"]
[]
[null,null,null,null,"Versão","2024-03-07"]
[]
[null,"Pressupostos do ESTAGIAR"]
[]
[null,"Conforme o Art.º 20.º do Regulamento dos Programas Estagiar, a FGF fica obrigada, após o período de estágio, à celebração de contrato a tempo completo por 1 ano, sem período experimental, com, pelo menos, 50% dos estagiários que iniciaram no mesmo mês."]
[null,"Assim, e de forma a cumprir com o exposto supra, será cabimentada verba para um ano de contrato. Na eventualidade de a FGF atingir a quota referida no Art.º 20.º, a verba poderá ser descabimentada."]
[null,"Neste contexto, e após usar este simulador, deverá o requerente usar, igualmente, o simulador para contratos de trabalho."]
[]
[null,"Tipo de Estagiar","Estagiar L"]
[]
[null,"Nos termos do Regulamento dos programas ESTAGIAR L, ESTAGIAR T e ESTAGIAR +:"]
[null,"1. O ESTAGIAR L destina-se a jovens recém-diplomados no ensino superior, detentores de nível VI, VII ou VIII do QNQ, que nunca tenham exercido funções na respetiva área de formação ao abrigo de contrato de trabalho, após a conclusão da respetiva formação."]
[null,"2. O ESTAGIAR T destina-se a jovens recém-diplomados em cursos de qualificação profissional, nível IV ou V do QNQ, que nunca tenham exercido funções na respetiva área de formação ao abrigo de contrato de trabalho, após a conclusão da respetiva formação."]
[null,"3. O ESTAGIAR + destina-se a jovens com qualificação igual ou inferior ao nível III do QNQ, inscritos no CQE há mais de três meses, quando estão à procura de primeiro emprego, ou jovens desempregados há mais de seis meses, quando estão à procura de novo emprego."]
[]
[null,"Data de Início (Mês/Ano)","2024-01-01"]
[]
[null,"Pretende Prorrogação?","Sim"]
[]
[null,"Os estágios têm a duração de 12 meses, incluindo um mês de descanso a gozar durante o 12.º mês de estágio, podendo ser prorrogados por um período de 3 meses."]
[]
[null,"Posição Remuneratória",{"$f":"INDEX('Estagiar - Tabela'!$C$7:$C$9,MATCH(fldTipoDeBolseiro,'Estagiar - Tabela'!$B$7:$B$9,0))","v":1076.25}]
[]
[null,"Estimativas"]
[]
[null,"O Seguro de Acidentes de Trabalho foi assumido como sendo 2% da compensação do ESTAGIAR, no entanto esse valor poderá variar conforme as condições de mercado."]
[]
[null,"Data","Compensação ESTAGIAR","Encargos Seg. Social","Seguro de Ac. de Trabalho"]
[null,null,"CE 040802A000","CE 010305A0B0","CE 020212B000"]
[]
[1,{"$f":"C21","v":"2024-01-01"},0,{"$f":"$C$27*22.3%","v":240.00375},{"$f":"1%*$C$27","v":10.762500000000001},{"$f":"YEAR(B36)","v":2024}]
[{"$f":"+A36+1","v":2},{"$f":"DATE(YEAR(B36),MONTH(B36)+1,DAY(B36))","v":"2024-02-01"},0,{"$f":"$C$27*22.3%","v":240.00375},{"$f":"1%*$C$27","v":10.762500000000001},{"$f":"YEAR(B37)","v":2024}]
[{"$f":"+A37+1","v":3},{"$f":"DATE(YEAR(B37),MONTH(B37)+1,DAY(B37))","v":"2024-03-01"},0,240.00375,10.762500000000001,2024]
[4,"2024-04-01",0,240.00375,10.762500000000001,2024]
[5,"2024-05-01",0,240.00375,10.762500000000001,2024]
{"$rows_left_out":26}
{"sheet":"Bolsa","index":3,"n_rows":56,"n_cols":6,"rows_kept":56,"cut":false,"hidden":false,"merged":[[27,1,27,4],[9,1,9,4],[17,1,17,4],[18,1,18,4],[2,2,2,4],[3,2,3,4],[26,1,26,4]]}
[]
[]
[null,null,"SIMULADOR DE CUSTOS COM RECURSOS HUMANOS"]
[null,null,"Bolsa"]
[]
[null,null,null,"Versão","2024-03-07"]
[]
[null,"Pressupostos da Bolsa"]
[]
[null,"Uma vez que a FGF recebe financiamento da Fundação para a Ciência e Tecnologia (FCT), esta está obrigada a aplicar o Estatuto do Bolseiro de Investigação e o Regulamento de Bolsas de Investigação a todos os bolseiros, mesmo quando a respetiva bolsa não seja financiada diretamente pela FCT."]
[]
[null,"Tipo de Bolsa","Bolsa de Investigacao",{"$f":"IF(fldTipoDeBolseiro=\"Bolsa de Investigacao\",fldTipoDeBolseiro&\" - \"&fldGrauAcademico,fldTipoDeBolseiro)","v":"Bolsa de Investigacao - Doutor"}]
[]
[null,"Grau Académico do Bolseiro","Doutor"]
[]
[null,"Data de Início (Mês/Ano)","2024-01-01"]
[]
[null,"As durações das bolsas encontram-se previstas nos Art.º 5º a 7º do Regulamento n.º 950/2019 da FCT e no Art.º 3º do Estatuto do Bolseiro de Investigação."]
[null,"Em regra, as bolsas têm uma duração entre 3 e 12 meses. Conforme a tipologia da bolsa, é possível a renovação - por exemplo, a bolsa de doutoramento pode ser renovada até atingir 4 anos."]
[]
[null,"Posição Remuneratória",{"$f":"INDEX('Bolsas - Tabela'!$D$5:$D$10,MATCH(Bolsa!D12,'Bolsas - Tabela'!$F$5:$F$10,0))","v":1801}]
[]
[null," Indexante dos Apoios Sociais",509.26]
[]
[null,"Estimativas"]
[]
[null,"As estimativas abaixo assumem que a bolsa terá uma duração de 12 meses. O Seguro Social Voluntário é opcional."]
[null,"O Seguro de Acidentes de Trabalho foi assumido como sendo 2% da compensação do ESTAGIAR, no entanto esse valor poderá variar conforme as condições de mercado."]
[]
[null,"Data","Valor da Bolsa","Seguro Social Voluntário","Seguro de Ac. de Trabalho"]
[null,null,"CE 040802BE00","CE 010305A0O0","CE 020212B000"]
[]
[1,{"$f":"C16","v":"2024-01-01"},{"$f":"fldPosicaoRemuneratoria","v":1801},{"$f":"C23*29.6%","v":150.74096000000003},{"$f":"1%*C33","v":18.010000000000002},{"$f":"YEAR(B33)","v":2024}]
[{"$f":"+A33+1","v":2},{"$f":"DATE(YEAR(B33),MONTH(B33)+1,DAY(B33))","v":"2024-02-01"},{"$f":"fldPosicaoRemuneratoria","v":1801},{"$f":"+D33","v":150.74096000000003},{"$f":"1%*C34","v":18.010000000000002},{"$f":"YEAR(B34)","v":2024}]
[{"$f":"+A34+1","v":3},{"$f":"DATE(YEAR(B34),MONTH(B34)+1,DAY(B34))","v":"2024-03-01"},1801,{"$f":"+D34","v":150.74096000000003},18.010000000000002,2024]
[4,"2024-04-01",1801,150.74096000000003,18.010000000000002,2024]
[5,"2024-05-01",1801,150.74096000000003,18.010000000000002,2024]
[6,"2024-06-01",1801,150.74096000000003,18.010000000000002,2024]
[7,"2024-07-01",1801,150.74096000000003,18.010000000000002,2024]
[8,"2024-08-01",1801,150.74096000000003,18.010000000000002,2024]
{"$rows_left_out":17}
{"sheet":"CT - Tabela","index":4,"n_rows":119,"n_cols":14,"rows_kept":119,"cut":false,"hidden":true,"merged":[[3,8,3,9]]}
["Tabela Remuneratória Única",null,null,null,null,null,null,null,"Tabela Remuneração Complementar"]
["Atualizada a 26/01/2024",null,null,null,null,null,null,null,"Atualizada a 08/11/2023"]
[]
[null,"Posição","Remuneração","Remuneração",null,"Geral e AT","TS",null,"Intervalo",null,"Percentagem","Montante","Acréscimo","Total"]
[null,1,null,{"$f":"RemComplementar(C5)","v":80.45},null,{"$f":"B5&\" - \"&ROUND(C5,2)","v":"1 - 0"},null,null,null,769.2,1,80.45,0,{"$f":"ROUND(L5+M5,2)","v":80.45}]
[null,{"$f":"+B5+1","v":2},null,{"$f":"RemComplementar(C6)","v":80.45},null,{"$f":"B6&\" - \"&ROUND(C6,2)","v":"2 - 0"},null,null,{"$f":"+J5+0.01","v":769.21},774.72,0.9,{"$f":"K6*$L$5","v":72.405000000000001},0,{"$f":"ROUND(L6+M6,2)","v":72.41}]
[null,{"$f":"+B6+1","v":3},null,{"$f":"RemComplementar(C7)","v":80.45},null,"3 - 0",null,null,{"$f":"+J6+0.01","v":774.73},780.25,0.85,{"$f":"+K7*$L$5","v":68.382500000000007},0,68.38]
[null,4,null,{"$f":"RemComplementar(C8)","v":80.45},null,"4 - 0",null,null,780.26,850.57,0.8,64.36,0,64.36]
[null,5,821.83,{"$f":"RemComplementar(C9)","v":64.36},null,"5 - 821,83",null,null,850.58,928.02,0.7,56.314999999999998,0,56.32]
[null,6,869.84,{"$f":"RemComplementar(C10)","v":56.32},null,"6 - 869,84",null,null,928.03,997.32,0.6,48.27,0,48.27]
[null,7,922.47,{"$f":"RemComplementar(C11)","v":56.32},null,"7 - 922,47",null,null,997.33,1121.6500000000001,0.55000000000000004,44.247500000000002,0,44.25]
[null,8,961.4,{"$f":"RemComplementar(C12)","v":48.27},null,"8 - 961,4",null,null,1121.6600000000001,1173.6199999999999,0.45,36.202500000000001,0,36.200000000000003]
[null,9,1017.56,{"$f":"RemComplementar(C13)","v":44.25},null,"9 - 1017,56",null,null,1173.6299999999999,1208.27,0.4,32.18,0,32.18]
[null,10,1070.19,{"$f":"RemComplementar(C14)","v":44.25},null,"10 - 1070,19",null,null,1208.28,1295.9100000000001,0.35,28.157499999999999,0,28.16]
[null,11,1122.8399999999999,{"$f":"RemComplementar(C15)","v":36.200000000000003},null,"11 - 1122,84",null,null,1295.92,1386.61,0.25,20.112500000000001,0,20.11]
[null,12,1175.46,{"$f":"RemComplementar(C16)","v":32.18},null,"12 - 1175,46"]
[null,13,1228.0899999999999,{"$f":"RemComplementar(C17)","v":28.16},null,"13 - 1228,09"]
[null,14,1280.72,{"$f":"RemComplementar(C18)","v":28.16},null,"14 - 1280,72"]
[null,15,1333.35,{"$f":"RemComplementar(C19)","v":20.11},null,"15 - 1333,35"]
[null,16,1385.99,{"$f":"RemComplementar(C20)","v":20.11},null,"16 - 1385,99",{"$f":"B20&\" - \"&ROUND(C20,2)","v":"16 - 1385,99"}]
[null,17,1438.62,{"$f":"RemComplementar(C21)","v":0},null,"17 - 1438,62",{"$f":"B21&\" - \"&ROUND(C21,2)","v":"17 - 1438,62"}]
[null,18,1491.25,{"$f":"RemComplementar(C22)","v":0},null,"18 - 1491,25","18 - 1491,25"]
[null,19,1543.88,{"$f":"RemComplementar(C23)","v":0},null,"19 - 1543,88","19 - 1543,88"]
[null,20,1596.52,{"$f":"RemComplementar(C24)","v":0},null,"20 - 1596,52","20 - 1596,52"]
[null,21,1649.15,{"$f":"RemComplementar(C25)","v":0},null,"21 - 1649,15","21 - 1649,15"]
[null,22,1701.78,{"$f":"RemComplementar(C26)","v":0},null,"22 - 1701,78","22 - 1701,78"]
[null,23,1754.41,{"$f":"RemComplementar(C27)","v":0},null,"23 - 1754,41","23 - 1754,41"]
[null,24,1807.04,{"$f":"RemComplementar(C28)","v":0},null,"24 - 1807,04","24 - 1807,04"]
[null,25,1861.25,{"$f":"RemComplementar(C29)","v":0},null,"25 - 1861,25","25 - 1861,25"]
[null,26,1915.46,{"$f":"RemComplementar(C30)","v":0},null,"26 - 1915,46","26 - 1915,46"]
[null,27,1969.68,{"$f":"RemComplementar(C31)","v":0},null,"27 - 1969,68","27 - 1969,68"]
[null,28,2023.89,{"$f":"RemComplementar(C32)","v":0},null,"28 - 2023,89","28 - 2023,89"]
[null,29,2078.11,{"$f":"RemComplementar(C33)","v":0},null,"29 - 2078,11","29 - 2078,11"]
[null,30,2132.3200000000002,{"$f":"RemComplementar(C34)","v":0},null,"30 - 2132,32","30 - 2132,32"]
[null,31,2186.5300000000002,{"$f":"RemComplementar(C35)","v":0},null,"31 - 2186,53","31 - 2186,53"]
[null,32,2240.7399999999998,{"$f":"RemComplementar(C36)","v":0},null,"32 - 2240,74","32 - 2240,74"]
[null,33,2294.9499999999998,{"$f":"RemComplementar(C37)","v":0},null,"33 - 2294,95","33 - 2294,95"]
[null,34,2349.15,{"$f":"RemComplementar(C38)","v":0},null,"34 - 2349,15","34 - 2349,15"]
[null,35,2403.37,{"$f":"RemComplementar(C39)","v":0},null,"35 - 2403,37","35 - 2403,37"]
[null,36,2457.5700000000002,{"$f":"RemComplementar(C40)","v":0},null,"36 - 2457,57","36 - 2457,57"]
{"$rows_left_out":80}
{"sheet":"Bolsas - Tabela","index":5,"n_rows":10,"n_cols":6,"rows_kept":10,"cut":false,"hidden":true,"merged":[]}
["Tabela de Bolsas da FCT"]
["Atualizada a 01/01/2023"]
[]
[null,"Tipo de Bolsa","Grau","Bolsa (Em Portugal)"]
[null,"Bolsa de Pos-Doutoramento ",null,1801,null,{"$f":"B5","v":"Bolsa de Pos-Doutoramento "}]
[null,"Bolsa de Doutoramento",null,1259.6400000000001,null,{"$f":"B6","v":"Bolsa de Doutoramento"}]
[null,"Bolsa de Investigacao","Doutor",1801,null,{"$f":"B7&\" - \"&C7","v":"Bolsa de Investigacao - Doutor"}]
[null,"Bolsa de Investigacao","Mestre",1259.6400000000001,null,{"$f":"B8&\" - \"&C8","v":"Bolsa de Investigacao - Mestre"}]
[null,"Bolsa de Investigacao","Licenciado",990.98,null,{"$f":"B9&\" - \"&C9","v":"Bolsa de Investigacao - Licenciado"}]
[null,"Bolsa de Iniciacao Cientifica",null,601.12,null,{"$f":"B10","v":"Bolsa de Iniciacao Cientifica"}]

{"sheet":"Estagiar - Tabela","index":6,"n_rows":9,"n_cols":3,"rows_kept":9,"cut":false,"hidden":true,"merged":[]}
["Tabela de Bolsas da FCT"]
["Atualizada a 01/01/2023"]
[]
[null,"RMMG-RAA",861]
[]
[null,"Tipo de Estágio","Bolsa (Em Portugal)"]
[null,"Estagiar L",{"$f":"+$C$4*1.25","v":1076.25}]
[null,"Estagiar T",{"$f":"+$C$4*1.05","v":904.05000000000007}]
[null,"Estagiar +",{"$f":"+$C$4","v":861}]

{"sheet":"Listas","index":7,"n_rows":8,"n_cols":12,"rows_kept":8,"cut":false,"hidden":true,"merged":[]}
[]
[]
[]
[null,"Tipo de Termo",null,"Categorias Profissionais",null,"Sim/Não",null,"Grau Académico",null,"Tipo de Bolsa",null,"Tipo de Estagiário"]
[null,"Certo",null,"Tecnico Superior",null,"Sim",null,"Doutor",null,"Bolsa de Pos-Doutoramento ",null,"Estagiar T"]
[null,"Incerto",null,"Assistente Tecnico",null,"Nao",null,"Mestre",null,"Bolsa de Doutoramento",null,"Estagiar L"]
[null,null,null,null,null,null,null,"Licenciado",null,"Bolsa de Investigacao",null,"Estagiar +"]
[null,null,null,null,null,null,null,null,null,"Bolsa de Iniciacao Cientifica"]